name,code,total,translated,translated_percent,translated_words_percent,total_words,translated_words,total_chars,translated_chars,translated_chars_percent,failing,failing_percent,fuzzy,fuzzy_percent,url_translate,url,translate_url,last_change,last_author,recent_changes,readonly,readonly_percent,approved,approved_percent,suggestions,comments
Arabic,ar,4,0,0.0,0.0,56,0,404,0,0.0,0,0.0,0,0.0,,https://translate.fedoraproject.org/projects/fedora-docs-l10n-fedora-release-notes/f28pagessysadminautomation/ar/,https://translate.fedoraproject.org/translate/fedora-docs-l10n-fedora-release-notes/f28pagessysadminautomation/ar/,,,0,0,0.0,0,0.0,1,0
Catalan,ca,4,0,0.0,0.0,56,0,404,0,0.0,0,0.0,0,0.0,,https://translate.fedoraproject.org/projects/fedora-docs-l10n-fedora-release-notes/f28pagessysadminautomation/ca/,https://translate.fedoraproject.org/translate/fedora-docs-l10n-fedora-release-notes/f28pagessysadminautomation/ca/,,,0,0,0.0,0,0.0,1,0
Czech,cs,4,0,0.0,0.0,56,0,404,0,0.0,0,0.0,0,0.0,,https://translate.fedoraproject.org/projects/fedora-docs-l10n-fedora-release-notes/f28pagessysadminautomation/cs/,https://translate.fedoraproject.org/translate/fedora-docs-l10n-fedora-release-notes/f28pagessysadminautomation/cs/,,,0,0,0.0,0,0.0,1,0
German,de,4,0,0.0,0.0,56,0,404,0,0.0,0,0.0,0,0.0,,https://translate.fedoraproject.org/projects/fedora-docs-l10n-fedora-release-notes/f28pagessysadminautomation/de/,https://translate.fedoraproject.org/translate/fedora-docs-l10n-fedora-release-notes/f28pagessysadminautomation/de/,2024-01-07 14:11:54.970110+00:00,,0,0,0.0,0,0.0,1,0
English,en,4,4,100.0,100.0,56,56,404,404,100.0,0,0.0,0,0.0,,https://translate.fedoraproject.org/projects/fedora-docs-l10n-fedora-release-notes/f28pagessysadminautomation/en/,https://translate.fedoraproject.org/translate/fedora-docs-l10n-fedora-release-notes/f28pagessysadminautomation/en/,,,0,4,100.0,0,0.0,0,0
Spanish,es,4,1,25.0,1.7,56,1,404,10,2.4,0,0.0,0,0.0,,https://translate.fedoraproject.org/projects/fedora-docs-l10n-fedora-release-notes/f28pagessysadminautomation/es/,https://translate.fedoraproject.org/translate/fedora-docs-l10n-fedora-release-notes/f28pagessysadminautomation/es/,2024-05-18 00:42:52.810982+00:00,,0,0,0.0,0,0.0,3,0
French,fr,4,1,25.0,1.7,56,1,404,10,2.4,0,0.0,0,0.0,,https://translate.fedoraproject.org/projects/fedora-docs-l10n-fedora-release-notes/f28pagessysadminautomation/fr/,https://translate.fedoraproject.org/translate/fedora-docs-l10n-fedora-release-notes/f28pagessysadminautomation/fr/,2024-05-18 00:42:19.146600+00:00,,0,0,0.0,0,0.0,0,0
Friulian,fur,4,0,0.0,0.0,56,0,404,0,0.0,0,0.0,0,0.0,,https://translate.fedoraproject.org/projects/fedora-docs-l10n-fedora-release-notes/f28pagessysadminautomation/fur/,https://translate.fedoraproject.org/translate/fedora-docs-l10n-fedora-release-notes/f28pagessysadminautomation/fur/,,,0,0,0.0,0,0.0,1,0
Croatian,hr,4,0,0.0,0.0,56,0,404,0,0.0,0,0.0,0,0.0,,https://translate.fedoraproject.org/projects/fedora-docs-l10n-fedora-release-notes/f28pagessysadminautomation/hr/,https://translate.fedoraproject.org/translate/fedora-docs-l10n-fedora-release-notes/f28pagessysadminautomation/hr/,,,0,0,0.0,0,0.0,1,0
Indonesian,id,4,1,25.0,1.7,56,1,404,10,2.4,0,0.0,0,0.0,,https://translate.fedoraproject.org/projects/fedora-docs-l10n-fedora-release-notes/f28pagessysadminautomation/id/,https://translate.fedoraproject.org/translate/fedora-docs-l10n-fedora-release-notes/f28pagessysadminautomation/id/,2024-05-18 00:46:24.101646+00:00,,0,0,0.0,0,0.0,0,0
Italian,it,4,0,0.0,0.0,56,0,404,0,0.0,0,0.0,0,0.0,,https://translate.fedoraproject.org/projects/fedora-docs-l10n-fedora-release-notes/f28pagessysadminautomation/it/,https://translate.fedoraproject.org/translate/fedora-docs-l10n-fedora-release-notes/f28pagessysadminautomation/it/,,,0,0,0.0,0,0.0,1,0
Japanese,ja,4,0,0.0,0.0,56,0,404,0,0.0,0,0.0,0,0.0,,https://translate.fedoraproject.org/projects/fedora-docs-l10n-fedora-release-notes/f28pagessysadminautomation/ja/,https://translate.fedoraproject.org/translate/fedora-docs-l10n-fedora-release-notes/f28pagessysadminautomation/ja/,,,0,0,0.0,0,0.0,1,0
Korean,ko,4,4,100.0,100.0,56,56,404,404,100.0,0,0.0,0,0.0,,https://translate.fedoraproject.org/projects/fedora-docs-l10n-fedora-release-notes/f28pagessysadminautomation/ko/,https://translate.fedoraproject.org/translate/fedora-docs-l10n-fedora-release-notes/f28pagessysadminautomation/ko/,2023-11-26 12:35:14.544234+00:00,,1,0,0.0,0,0.0,0,0
Dutch,nl,4,0,0.0,0.0,56,0,404,0,0.0,0,0.0,0,0.0,,https://translate.fedoraproject.org/projects/fedora-docs-l10n-fedora-release-notes/f28pagessysadminautomation/nl/,https://translate.fedoraproject.org/translate/fedora-docs-l10n-fedora-release-notes/f28pagessysadminautomation/nl/,,,0,0,0.0,0,0.0,1,0
Polish,pl,4,1,25.0,1.7,56,1,404,10,2.4,0,0.0,0,0.0,,https://translate.fedoraproject.org/projects/fedora-docs-l10n-fedora-release-notes/f28pagessysadminautomation/pl/,https://translate.fedoraproject.org/translate/fedora-docs-l10n-fedora-release-notes/f28pagessysadminautomation/pl/,2024-05-18 00:46:24.165519+00:00,,0,0,0.0,0,0.0,0,0
Portuguese (Brazil),pt_BR,4,1,25.0,1.7,56,1,404,10,2.4,0,0.0,0,0.0,,https://translate.fedoraproject.org/projects/fedora-docs-l10n-fedora-release-notes/f28pagessysadminautomation/pt_BR/,https://translate.fedoraproject.org/translate/fedora-docs-l10n-fedora-release-notes/f28pagessysadminautomation/pt_BR/,2023-12-18 20:29:23.708107+00:00,,1,0,0.0,0,0.0,0,0
Portuguese (Portugal),pt_PT,4,0,0.0,0.0,56,0,404,0,0.0,0,0.0,0,0.0,,https://translate.fedoraproject.org/projects/fedora-docs-l10n-fedora-release-notes/f28pagessysadminautomation/pt_PT/,https://translate.fedoraproject.org/translate/fedora-docs-l10n-fedora-release-notes/f28pagessysadminautomation/pt_PT/,,,0,0,0.0,0,0.0,0,0
Russian,ru,4,0,0.0,0.0,56,0,404,0,0.0,0,0.0,0,0.0,,https://translate.fedoraproject.org/projects/fedora-docs-l10n-fedora-release-notes/f28pagessysadminautomation/ru/,https://translate.fedoraproject.org/translate/fedora-docs-l10n-fedora-release-notes/f28pagessysadminautomation/ru/,,,0,0,0.0,0,0.0,1,0
Turkish,tr,4,1,25.0,1.7,56,1,404,10,2.4,0,0.0,0,0.0,,https://translate.fedoraproject.org/projects/fedora-docs-l10n-fedora-release-notes/f28pagessysadminautomation/tr/,https://translate.fedoraproject.org/translate/fedora-docs-l10n-fedora-release-notes/f28pagessysadminautomation/tr/,2024-05-18 00:46:24.202573+00:00,,0,0,0.0,0,0.0,3,0
Ukrainian,uk,4,0,0.0,0.0,56,0,404,0,0.0,0,0.0,0,0.0,,https://translate.fedoraproject.org/projects/fedora-docs-l10n-fedora-release-notes/f28pagessysadminautomation/uk/,https://translate.fedoraproject.org/translate/fedora-docs-l10n-fedora-release-notes/f28pagessysadminautomation/uk/,,,0,0,0.0,0,0.0,1,0
Urdu,ur,4,0,0.0,0.0,56,0,404,0,0.0,0,0.0,0,0.0,,https://translate.fedoraproject.org/projects/fedora-docs-l10n-fedora-release-notes/f28pagessysadminautomation/ur/,https://translate.fedoraproject.org/translate/fedora-docs-l10n-fedora-release-notes/f28pagessysadminautomation/ur/,,,0,0,0.0,0,0.0,0,0
Urdu (Pakistan),ur_PK,4,0,0.0,0.0,56,0,404,0,0.0,0,0.0,0,0.0,,https://translate.fedoraproject.org/projects/fedora-docs-l10n-fedora-release-notes/f28pagessysadminautomation/ur_PK/,https://translate.fedoraproject.org/translate/fedora-docs-l10n-fedora-release-notes/f28pagessysadminautomation/ur_PK/,,,0,0,0.0,0,0.0,0,0
Chinese (Simplified),zh_CN,4,0,0.0,0.0,56,0,404,0,0.0,0,0.0,0,0.0,,https://translate.fedoraproject.org/projects/fedora-docs-l10n-fedora-release-notes/f28pagessysadminautomation/zh_CN/,https://translate.fedoraproject.org/translate/fedora-docs-l10n-fedora-release-notes/f28pagessysadminautomation/zh_CN/,,,0,0,0.0,0,0.0,1,0
Chinese (Simplified),zh_Hans,4,0,0.0,0.0,56,0,404,0,0.0,0,0.0,0,0.0,,https://translate.fedoraproject.org/projects/fedora-docs-l10n-fedora-release-notes/f28pagessysadminautomation/zh_Hans/,https://translate.fedoraproject.org/translate/fedora-docs-l10n-fedora-release-notes/f28pagessysadminautomation/zh_Hans/,,,0,0,0.0,0,0.0,0,0
