name,code,total,translated,translated_percent,translated_words_percent,total_words,translated_words,total_chars,translated_chars,translated_chars_percent,failing,failing_percent,fuzzy,fuzzy_percent,url_translate,url,translate_url,last_change,last_author,recent_changes,readonly,readonly_percent,approved,approved_percent,suggestions,comments
Arabic,ar,1,0,0.0,0.0,1,0,10,0,0.0,0,0.0,0,0.0,,https://translate.fedoraproject.org/projects/fedora-docs-l10n-fedora-release-notes/f28pagesdeveloperscontainers/ar/,https://translate.fedoraproject.org/translate/fedora-docs-l10n-fedora-release-notes/f28pagesdeveloperscontainers/ar/,,,0,0,0.0,0,0.0,1,0
Catalan,ca,1,0,0.0,0.0,1,0,10,0,0.0,0,0.0,0,0.0,,https://translate.fedoraproject.org/projects/fedora-docs-l10n-fedora-release-notes/f28pagesdeveloperscontainers/ca/,https://translate.fedoraproject.org/translate/fedora-docs-l10n-fedora-release-notes/f28pagesdeveloperscontainers/ca/,,,0,0,0.0,0,0.0,1,0
Czech,cs,1,0,0.0,0.0,1,0,10,0,0.0,0,0.0,0,0.0,,https://translate.fedoraproject.org/projects/fedora-docs-l10n-fedora-release-notes/f28pagesdeveloperscontainers/cs/,https://translate.fedoraproject.org/translate/fedora-docs-l10n-fedora-release-notes/f28pagesdeveloperscontainers/cs/,,,0,0,0.0,0,0.0,1,0
German,de,1,0,0.0,0.0,1,0,10,0,0.0,0,0.0,0,0.0,,https://translate.fedoraproject.org/projects/fedora-docs-l10n-fedora-release-notes/f28pagesdeveloperscontainers/de/,https://translate.fedoraproject.org/translate/fedora-docs-l10n-fedora-release-notes/f28pagesdeveloperscontainers/de/,2024-01-07 14:13:53.919493+00:00,,0,0,0.0,0,0.0,1,0
English,en,1,1,100.0,100.0,1,1,10,10,100.0,0,0.0,0,0.0,,https://translate.fedoraproject.org/projects/fedora-docs-l10n-fedora-release-notes/f28pagesdeveloperscontainers/en/,https://translate.fedoraproject.org/translate/fedora-docs-l10n-fedora-release-notes/f28pagesdeveloperscontainers/en/,2024-01-07 14:13:53.610877+00:00,,0,1,100.0,0,0.0,0,0
Spanish,es,1,1,100.0,100.0,1,1,10,10,100.0,0,0.0,0,0.0,,https://translate.fedoraproject.org/projects/fedora-docs-l10n-fedora-release-notes/f28pagesdeveloperscontainers/es/,https://translate.fedoraproject.org/translate/fedora-docs-l10n-fedora-release-notes/f28pagesdeveloperscontainers/es/,2024-05-18 00:42:50.733092+00:00,,0,0,0.0,0,0.0,0,0
French,fr,1,1,100.0,100.0,1,1,10,10,100.0,0,0.0,0,0.0,,https://translate.fedoraproject.org/projects/fedora-docs-l10n-fedora-release-notes/f28pagesdeveloperscontainers/fr/,https://translate.fedoraproject.org/translate/fedora-docs-l10n-fedora-release-notes/f28pagesdeveloperscontainers/fr/,2024-05-18 00:42:13.366279+00:00,,0,0,0.0,0,0.0,0,0
Friulian,fur,1,0,0.0,0.0,1,0,10,0,0.0,0,0.0,0,0.0,,https://translate.fedoraproject.org/projects/fedora-docs-l10n-fedora-release-notes/f28pagesdeveloperscontainers/fur/,https://translate.fedoraproject.org/translate/fedora-docs-l10n-fedora-release-notes/f28pagesdeveloperscontainers/fur/,,,0,0,0.0,0,0.0,1,0
Croatian,hr,1,0,0.0,0.0,1,0,10,0,0.0,0,0.0,0,0.0,,https://translate.fedoraproject.org/projects/fedora-docs-l10n-fedora-release-notes/f28pagesdeveloperscontainers/hr/,https://translate.fedoraproject.org/translate/fedora-docs-l10n-fedora-release-notes/f28pagesdeveloperscontainers/hr/,,,0,0,0.0,0,0.0,1,0
Indonesian,id,1,1,100.0,100.0,1,1,10,10,100.0,0,0.0,0,0.0,,https://translate.fedoraproject.org/projects/fedora-docs-l10n-fedora-release-notes/f28pagesdeveloperscontainers/id/,https://translate.fedoraproject.org/translate/fedora-docs-l10n-fedora-release-notes/f28pagesdeveloperscontainers/id/,2024-05-17 04:33:08.399249+00:00,,1,0,0.0,0,0.0,1,0
Italian,it,1,0,0.0,0.0,1,0,10,0,0.0,0,0.0,0,0.0,,https://translate.fedoraproject.org/projects/fedora-docs-l10n-fedora-release-notes/f28pagesdeveloperscontainers/it/,https://translate.fedoraproject.org/translate/fedora-docs-l10n-fedora-release-notes/f28pagesdeveloperscontainers/it/,,,0,0,0.0,0,0.0,1,0
Japanese,ja,1,0,0.0,0.0,1,0,10,0,0.0,0,0.0,0,0.0,,https://translate.fedoraproject.org/projects/fedora-docs-l10n-fedora-release-notes/f28pagesdeveloperscontainers/ja/,https://translate.fedoraproject.org/translate/fedora-docs-l10n-fedora-release-notes/f28pagesdeveloperscontainers/ja/,,,0,0,0.0,0,0.0,1,0
Korean,ko,1,1,100.0,100.0,1,1,10,10,100.0,0,0.0,0,0.0,,https://translate.fedoraproject.org/projects/fedora-docs-l10n-fedora-release-notes/f28pagesdeveloperscontainers/ko/,https://translate.fedoraproject.org/translate/fedora-docs-l10n-fedora-release-notes/f28pagesdeveloperscontainers/ko/,2024-01-07 14:13:54.519928+00:00,,0,0,0.0,0,0.0,0,0
Dutch,nl,1,0,0.0,0.0,1,0,10,0,0.0,0,0.0,0,0.0,,https://translate.fedoraproject.org/projects/fedora-docs-l10n-fedora-release-notes/f28pagesdeveloperscontainers/nl/,https://translate.fedoraproject.org/translate/fedora-docs-l10n-fedora-release-notes/f28pagesdeveloperscontainers/nl/,,,0,0,0.0,0,0.0,1,0
Polish,pl,1,1,100.0,100.0,1,1,10,10,100.0,0,0.0,0,0.0,,https://translate.fedoraproject.org/projects/fedora-docs-l10n-fedora-release-notes/f28pagesdeveloperscontainers/pl/,https://translate.fedoraproject.org/translate/fedora-docs-l10n-fedora-release-notes/f28pagesdeveloperscontainers/pl/,2024-05-18 00:46:23.617309+00:00,,0,0,0.0,0,0.0,0,0
Portuguese (Brazil),pt_BR,1,1,100.0,100.0,1,1,10,10,100.0,0,0.0,0,0.0,,https://translate.fedoraproject.org/projects/fedora-docs-l10n-fedora-release-notes/f28pagesdeveloperscontainers/pt_BR/,https://translate.fedoraproject.org/translate/fedora-docs-l10n-fedora-release-notes/f28pagesdeveloperscontainers/pt_BR/,2023-12-18 20:42:22.057781+00:00,,1,0,0.0,0,0.0,0,0
Portuguese (Portugal),pt_PT,1,0,0.0,0.0,1,0,10,0,0.0,0,0.0,0,0.0,,https://translate.fedoraproject.org/projects/fedora-docs-l10n-fedora-release-notes/f28pagesdeveloperscontainers/pt_PT/,https://translate.fedoraproject.org/translate/fedora-docs-l10n-fedora-release-notes/f28pagesdeveloperscontainers/pt_PT/,,,0,0,0.0,0,0.0,1,0
Russian,ru,1,0,0.0,0.0,1,0,10,0,0.0,0,0.0,0,0.0,,https://translate.fedoraproject.org/projects/fedora-docs-l10n-fedora-release-notes/f28pagesdeveloperscontainers/ru/,https://translate.fedoraproject.org/translate/fedora-docs-l10n-fedora-release-notes/f28pagesdeveloperscontainers/ru/,2024-01-07 14:13:54.907887+00:00,,0,0,0.0,0,0.0,1,0
Turkish,tr,1,1,100.0,100.0,1,1,10,10,100.0,0,0.0,0,0.0,,https://translate.fedoraproject.org/projects/fedora-docs-l10n-fedora-release-notes/f28pagesdeveloperscontainers/tr/,https://translate.fedoraproject.org/translate/fedora-docs-l10n-fedora-release-notes/f28pagesdeveloperscontainers/tr/,2024-05-18 00:46:23.673299+00:00,,0,0,0.0,0,0.0,0,0
Ukrainian,uk,1,0,0.0,0.0,1,0,10,0,0.0,0,0.0,0,0.0,,https://translate.fedoraproject.org/projects/fedora-docs-l10n-fedora-release-notes/f28pagesdeveloperscontainers/uk/,https://translate.fedoraproject.org/translate/fedora-docs-l10n-fedora-release-notes/f28pagesdeveloperscontainers/uk/,,,0,0,0.0,0,0.0,1,0
Urdu,ur,1,0,0.0,0.0,1,0,10,0,0.0,0,0.0,0,0.0,,https://translate.fedoraproject.org/projects/fedora-docs-l10n-fedora-release-notes/f28pagesdeveloperscontainers/ur/,https://translate.fedoraproject.org/translate/fedora-docs-l10n-fedora-release-notes/f28pagesdeveloperscontainers/ur/,,,0,0,0.0,0,0.0,0,0
Urdu (Pakistan),ur_PK,1,0,0.0,0.0,1,0,10,0,0.0,0,0.0,0,0.0,,https://translate.fedoraproject.org/projects/fedora-docs-l10n-fedora-release-notes/f28pagesdeveloperscontainers/ur_PK/,https://translate.fedoraproject.org/translate/fedora-docs-l10n-fedora-release-notes/f28pagesdeveloperscontainers/ur_PK/,,,0,0,0.0,0,0.0,0,0
Chinese (Simplified),zh_CN,1,0,0.0,0.0,1,0,10,0,0.0,0,0.0,0,0.0,,https://translate.fedoraproject.org/projects/fedora-docs-l10n-fedora-release-notes/f28pagesdeveloperscontainers/zh_CN/,https://translate.fedoraproject.org/translate/fedora-docs-l10n-fedora-release-notes/f28pagesdeveloperscontainers/zh_CN/,,,0,0,0.0,0,0.0,1,0
Chinese (Simplified),zh_Hans,1,0,0.0,0.0,1,0,10,0,0.0,0,0.0,0,0.0,,https://translate.fedoraproject.org/projects/fedora-docs-l10n-fedora-release-notes/f28pagesdeveloperscontainers/zh_Hans/,https://translate.fedoraproject.org/translate/fedora-docs-l10n-fedora-release-notes/f28pagesdeveloperscontainers/zh_Hans/,,,0,0,0.0,0,0.0,1,0
